Target
Alpha-2A adrenergic receptor
Ligand
BDBM50166559
Substrate
Meas. Tech.
ChEMBL_306656 (CHEMBL831429)
IC50
58±n/a nM
Citation
 Kanuma, KOmodera, KNishiguchi, MFunakoshi, TChaki, SSemple, GTran, TAKramer, BHsu, DCasper, MThomsen, BBeeley, NSekiguchi, Y Discovery of 4-(dimethylamino)quinazolines as potent and selective antagonists for the melanin-concentrating hormone receptor 1. Bioorg Med Chem Lett 15:2565-9 (2005)  
Target
Name:
Alpha-2A adrenergic receptor
Synonyms:
ADA2A_HUMAN ADRA2R Adrenergic alpha2A Alpha-2 adrenergic receptor subtype C10 Alpha-2A adrenoreceptor alpha-2A adrenergic receptor [Homo sapiens]
Type:
Enzyme
Mol. Mass.:
48979.91
Organism:
Homo sapiens (Human)
Description:
P08913
Residue:
465
  
Inhibitor
Name:
BDBM50166559
Synonyms:
Butane-1-sulfonic acid {4-[(4-dimethylamino-quinazolin-2-ylamino)-methyl]-cyclohexylmethyl}-amide | CHEMBL193666
Type:
Small organic molecule
Emp. Form.:
C22H35N5O2S
Mol. Mass.:
433.611
SMILES:
CCCCS(=O)(=O)NCC1CCC(CNc2nc(N(C)C)c3ccccc3n2)CC1
: