Target
G protein-activated inward rectifier potassium channel 1
Ligand
BDBM50593376
Substrate
Meas. Tech.
ChEMBL_2208081 (CHEMBL5121030)
EC50
239±n/a nM
Citation
 Sharma, SLesiak, LAretz, CDDu, YKumar, SGautam, NAlnouti, YDhuria, NVChhonker, YSWeaver, CDHopkins, CR Discovery, synthesis and biological characterization of a series of  RSC Med Chem 12:1366-1373 (2021) Target
Name:
G protein-activated inward rectifier potassium channel 1
Synonyms:
GIRK-1 Inward rectifier K(+) channel Kir3.1 KCNJ3_HUMAN | Potassium channel, inwardly rectifying subfamily J member 3
Type:
PROTEIN
Mol. Mass.:
56610.74
Organism:
Homo sapiens (Human)
Description:
ChEMBL_107915
Residue:
501
  
Inhibitor
Name:
BDBM50593376
Synonyms:
CHEMBL5180586
Type:
Small organic molecule
Emp. Form.:
C16H17Cl2N3O4S
Mol. Mass.:
418.295
SMILES:
Cc1cc(NC(=O)COc2cccc(Cl)c2Cl)n(n1)C1CCS(=O)(=O)C1
: