Target
G protein-activated inward rectifier potassium channel 1
Ligand
BDBM50593406
Substrate
Meas. Tech.
ChEMBL_2208081 (CHEMBL5121030)
EC50
88±n/a nM
Citation
 Sharma, SLesiak, LAretz, CDDu, YKumar, SGautam, NAlnouti, YDhuria, NVChhonker, YSWeaver, CDHopkins, CR Discovery, synthesis and biological characterization of a series of  RSC Med Chem 12:1366-1373 (2021) Target
Name:
G protein-activated inward rectifier potassium channel 1
Synonyms:
GIRK-1 Inward rectifier K(+) channel Kir3.1 KCNJ3_HUMAN | Potassium channel, inwardly rectifying subfamily J member 3
Type:
PROTEIN
Mol. Mass.:
56610.74
Organism:
Homo sapiens (Human)
Description:
ChEMBL_107915
Residue:
501
  
Inhibitor
Name:
BDBM50593406
Synonyms:
CHEMBL5206362
Type:
Small organic molecule
Emp. Form.:
C17H19Cl2N3O3
Mol. Mass.:
384.257
SMILES:
Cc1cc(NC(=O)COc2ccc(Cl)cc2Cl)n(n1)C1CCOCC1
: