Target
Corticotropin-releasing factor receptor 1
Ligand
BDBM50071235
Substrate
Meas. Tech.
ChEMBL_2208399 (CHEMBL5121348)
IC50
76±n/a nM
Citation
 Das, BBaidya, ATKMathew, ATYadav, AKKumar, R Structural modification aimed for improving solubility of lead compounds in early phase drug discovery. Bioorg Med Chem 56:0 (2022) Target
Name:
Corticotropin-releasing factor receptor 1
Synonyms:
CRF-R CRF1 CRFR1 CRH-R 1 CRHR1 Corticotropin-releasing factor receptor 1 (CRF-1) Corticotropin-releasing hormone receptor 1
Type:
Enzyme
Mol. Mass.:
50744.31
Organism:
Homo sapiens (Human)
Description:
P34998
Residue:
444
  
Inhibitor
Name:
BDBM50071235
Synonyms:
CHEMBL65078 Cyclopropylmethyl-[3-(2,4-dichloro-phenyl)-2,5-dimethyl-pyrazolo[1,5-a]pyrimidin-7-yl]-propyl-amine
Type:
Small organic molecule
Emp. Form.:
C21H24Cl2N4
Mol. Mass.:
403.348
SMILES:
CCCN(CC1CC1)c1cc(C)nc2c(c(C)nn12)-c1ccc(Cl)cc1Cl
: