Target
Delta-type opioid receptor
Ligand
BDBM50167090
Substrate
Meas. Tech.
ChEMBL_303226 (CHEMBL827191)
Ki
1096±n/a nM
Citation
 Van den Eynde, ILaus, GSchiller, PWKosson, PChung, NNLipkowski, AWTourwé, D A new structural motif for mu-opioid antagonists. J Med Chem 48:3644-8 (2005)  
Target
Name:
Delta-type opioid receptor
Synonyms:
Cytochrome P450 3A4 Delta opioid receptor Delta-type opioid receptor (DOR) OPRD_RAT Opioid receptor Opioid receptors; mu & delta Ror-a | Voltage-gated potassium channel
Type:
G Protein-Coupled Receptor (GPCR)
Mol. Mass.:
40465.04
Organism:
Rattus norvegicus (rat)
Description:
Competition binding assays were using CHO-K1 cell membranes expressing the opioid receptor.
Residue:
372
  
Inhibitor
Name:
BDBM50167090
Synonyms:
CHEMBL192515 | N-{(R)-2-[(S)-2-Amino-3-(4-hydroxy-2,6-dimethyl-phenyl)-propyl]-3-oxo-2,3,4,5-tetrahydro-1H-benzo[c]azepin-4-yl}-2-phenyl-acetamide
Type:
Small organic molecule
Emp. Form.:
C29H33N3O3
Mol. Mass.:
471.5906
SMILES:
Cc1cc(O)cc(C)c1C[C@H](N)CN1Cc2ccccc2C[C@@H](NC(=O)Cc2ccccc2)C1=O
: