Target
Adenosine kinase
Ligand
BDBM50167599
Substrate
Meas. Tech.
ChEMBL_304674 (CHEMBL877308)
IC50
11±n/a nM
Citation
 Perner, RJLee, CHJiang, MGu, YGDidomenico, SBayburt, EKAlexander, KMKohlhaas, KLJarvis, MFKowaluk, ELBhagwat, SS Synthesis and biological evaluation of 6,7-disubstituted 4-aminopyrido[2,3-d]pyrimidines as adenosine kinase inhibitors. Bioorg Med Chem Lett 15:2803-7 (2005)  
Target
Name:
Adenosine kinase
Synonyms:
ADK | ADK_HUMAN
Type:
PROTEIN
Mol. Mass.:
40545.97
Organism:
Homo sapiens (Human)
Description:
ChEMBL_1467841
Residue:
362
  
Inhibitor
Name:
BDBM50167599
Synonyms:
6-Butyl-7-thiophen-2-yl-pyrido[2,3-d]pyrimidin-4-ylamine | CHEMBL193253
Type:
Small organic molecule
Emp. Form.:
C15H16N4S
Mol. Mass.:
284.379
SMILES:
CCCCc1cc2c(N)ncnc2nc1-c1cccs1
: