Target
Adenosine kinase
Ligand
BDBM50100583
Substrate
Meas. Tech.
ChEMBL_304761 (CHEMBL829358)
IC50
567±n/a nM
Citation
 Perner, RJLee, CHJiang, MGu, YGDidomenico, SBayburt, EKAlexander, KMKohlhaas, KLJarvis, MFKowaluk, ELBhagwat, SS Synthesis and biological evaluation of 6,7-disubstituted 4-aminopyrido[2,3-d]pyrimidines as adenosine kinase inhibitors. Bioorg Med Chem Lett 15:2803-7 (2005)  
Target
Name:
Adenosine kinase
Synonyms:
ADK | ADK_HUMAN
Type:
PROTEIN
Mol. Mass.:
40545.97
Organism:
Homo sapiens (Human)
Description:
ChEMBL_1467841
Residue:
362
  
Inhibitor
Name:
BDBM50100583
Synonyms:
7-(4-Dimethylamino-phenyl)-6-(4-methoxy-phenyl)-pyrido[2,3-d]pyrimidin-4-ylamine | CHEMBL302938
Type:
Small organic molecule
Emp. Form.:
C22H21N5O
Mol. Mass.:
371.435
SMILES:
COc1ccc(cc1)-c1cc2c(N)ncnc2nc1-c1ccc(cc1)N(C)C
: