Target
Adenosine kinase
Ligand
BDBM50167595
Substrate
Meas. Tech.
ChEMBL_304674 (CHEMBL877308)
IC50
70±n/a nM
Citation
 Perner, RJLee, CHJiang, MGu, YGDidomenico, SBayburt, EKAlexander, KMKohlhaas, KLJarvis, MFKowaluk, ELBhagwat, SS Synthesis and biological evaluation of 6,7-disubstituted 4-aminopyrido[2,3-d]pyrimidines as adenosine kinase inhibitors. Bioorg Med Chem Lett 15:2803-7 (2005)  
Target
Name:
Adenosine kinase
Synonyms:
ADK | ADK_HUMAN
Type:
PROTEIN
Mol. Mass.:
40545.97
Organism:
Homo sapiens (Human)
Description:
ChEMBL_1467841
Residue:
362
  
Inhibitor
Name:
BDBM50167595
Synonyms:
6-(3-Bromo-phenyl)-7-(4-dimethylamino-phenyl)-pyrido[2,3-d]pyrimidin-4-ylamine | CHEMBL189576
Type:
Small organic molecule
Emp. Form.:
C21H18BrN5
Mol. Mass.:
420.305
SMILES:
CN(C)c1ccc(cc1)-c1nc2ncnc(N)c2cc1-c1cccc(Br)c1
: