Target
Adenosine kinase
Ligand
BDBM50167588
Substrate
Meas. Tech.
ChEMBL_304761 (CHEMBL829358)
IC50
650±n/a nM
Citation
 Perner, RJLee, CHJiang, MGu, YGDidomenico, SBayburt, EKAlexander, KMKohlhaas, KLJarvis, MFKowaluk, ELBhagwat, SS Synthesis and biological evaluation of 6,7-disubstituted 4-aminopyrido[2,3-d]pyrimidines as adenosine kinase inhibitors. Bioorg Med Chem Lett 15:2803-7 (2005)  
Target
Name:
Adenosine kinase
Synonyms:
ADK | ADK_HUMAN
Type:
PROTEIN
Mol. Mass.:
40545.97
Organism:
Homo sapiens (Human)
Description:
ChEMBL_1467841
Residue:
362
  
Inhibitor
Name:
BDBM50167588
Synonyms:
6-Benzyl-7-(4-dimethylamino-phenyl)-pyrido[2,3-d]pyrimidin-4-ylamine | CHEMBL426992
Type:
Small organic molecule
Emp. Form.:
C22H21N5
Mol. Mass.:
355.4356
SMILES:
CN(C)c1ccc(cc1)-c1nc2ncnc(N)c2cc1Cc1ccccc1
: