Target
P2X purinoceptor 1
Ligand
BDBM526264
Substrate
Meas. Tech.
ChEMBL_2213098 (CHEMBL5126047)
IC50
3.5±n/a nM
Citation
 Isaak, ADobelmann, CFüsser, FTErlitz, KSKoch, OJunker, A Unveiling the Structure-Activity Relationships at the Orthosteric Binding Site of P2X Ion Channels: The Route to Selectivity. J Med Chem 65:11291-11308 (2022) Target
Name:
P2X purinoceptor 1
Synonyms:
ATP receptor P2RX1_HUMAN Purinergic receptor | Purinergic, P2X
Type:
Enzyme Catalytic Domain
Mol. Mass.:
44992.65
Organism:
Homo sapiens (Human)
Description:
Purinergic, P2X 0 HUMAN::P51575
Residue:
399
  
Inhibitor
Name:
BDBM526264
Synonyms:
US11185100, TABLE 14.4
Type:
Small organic molecule
Emp. Form.:
C10H14ClN4O13P3
Mol. Mass.:
526.611
SMILES:
O[C@@H]1[C@@H](COP(O)(=O)OP(O)(=O)OP(O)(O)=O)O[C@H]([C@@H]1O)n1cnc2c(Cl)ncnc12
: