Target
Cytoplasmic tyrosine-protein kinase BMX
Ligand
BDBM50594746
Substrate
Meas. Tech.
ChEMBL_2214126 (CHEMBL5127258)
IC50
1.4±n/a nM
Citation
 Ran, FLiu, YWang, CXu, ZZhang, YLiu, YZhao, GLing, Y Review of the development of BTK inhibitors in overcoming the clinical limitations of ibrutinib. Eur J Med Chem 229:0 (2022) Target
Name:
Cytoplasmic tyrosine-protein kinase BMX
Synonyms:
BMX BMX_HUMAN Cytoplasmic tyrosine-protein kinase BMX (BMX) Epithelial and endothelial tyrosine kinase Tyrosine Kinase BMX | Tyrosine-protein kinase BMX/ETK
Type:
Tyrosine-protein kinase
Mol. Mass.:
78030.42
Organism:
Homo sapiens (Human)
Description:
P51813
Residue:
675
  
Inhibitor
Name:
BDBM50594746
Synonyms:
CHEMBL5193128
Type:
Small organic molecule
Emp. Form.:
C27H31N5O3
Mol. Mass.:
473.5667
SMILES:
NC(=O)C1C2NCC[C@@H](C3CCN(CC3)C(=O)C=C)N2N=C1c1ccc(Oc2ccccc2)cc1
: