Target
Dual specificity tyrosine-phosphorylation-regulated kinase 3
Ligand
BDBM50347746
Substrate
Meas. Tech.
ChEMBL_2214251 (CHEMBL5127383)
IC50
140±n/a nM
Citation
 Tahtouh, TDurieu, EVilliers, BBruyère, CNguyen, TLFant, XAhn, KHKhurana, LDeau, ELindberg, MFSévère, EMiege, FRoche, DLimanton, EL'Helgoual'ch, JMBurgy, GGuiheneuf, SHerault, YKendall, DACarreaux, FBazureau, JPMeijer, L Structure-Activity Relationship in the Leucettine Family of Kinase Inhibitors. J Med Chem 65:1396-1417 (2022) Target
Name:
Dual specificity tyrosine-phosphorylation-regulated kinase 3
Synonyms:
DYRK3 Dual-specificity tyrosine-phosphorylation regulated kinase 3
Type:
PROTEIN
Mol. Mass.:
65747.26
Organism:
Homo sapiens (Human)
Description:
ChEMBL_1508026
Residue:
588
  
Inhibitor
Name:
BDBM50347746
Synonyms:
CHEMBL1803085
Type:
Small organic molecule
Emp. Form.:
C17H13N3O4
Mol. Mass.:
323.3028
SMILES:
Oc1ccc(NC2=NC(=Cc3ccc4OCOc4c3)C(=O)N2)cc1
: