Target
Delta-type opioid receptor
Ligand
BDBM50059841
Substrate
Meas. Tech.
ChEMBL_2214430 (CHEMBL5127562)
IC50
74±n/a nM
Citation
 Smith, MTKong, DKuo, AImam, MZWilliams, CM Analgesic Opioid Ligand Discovery Based on Nonmorphinan Scaffolds Derived from Natural Sources. J Med Chem 65:1612-1661 (2022) Target
Name:
Delta-type opioid receptor
Synonyms:
DOR-1 MSL-2 OPRD_MOUSE Oprd1
Type:
Enzyme Catalytic Domain
Mol. Mass.:
40577.25
Organism:
MOUSE
Description:
P32300
Residue:
372
  
Inhibitor
Name:
BDBM50059841
Synonyms:
(S)-1-[(S)-2-[2-((S)-2-{(R)-2-[(S)-2-Amino-3-(4-hydroxy-phenyl)-propionylamino]-propionylamino}-3-phenyl-propionylamino)-acetylamino]-3-(4-hydroxy-phenyl)-propionyl]-pyrrolidine-2-carboxylic acid ((S)-1-carbamoyl-2-hydroxy-ethyl)-amide 1-[2-[2-(2-{2-[2-Amino-3-(4-hydroxy-phenyl)-propionylamino]-propionylamino}-3-phenyl-propionylamino)-acetylamino]-3-(4-hydroxy-phenyl)-propionyl]-pyrrolidine-2-carboxylic acid (1-carbamoyl-2-hydroxy-ethyl)-amide 1-[2-[2-(2-{2-[2-Amino-3-(4-hydroxy-phenyl)-propionylamino]-propionylamino}-3-phenyl-propionylamino)-acetylamino]-3-(4-hydroxy-phenyl)-propionyl]-pyrrolidine-2-carboxylic acid (1-carbamoyl-2-hydroxy-ethyl)-amide(Dermorphin) DERMORPHIN H-Tyr-D-Ala-Phe-Gly-Tyr-Pro-Ser-NH2 YAFGYPS-NH2
Type:
Small organic molecule
Emp. Form.:
C40H50N8O10
Mol. Mass.:
802.8726
SMILES:
C[C@@H](NC(=O)[C@@H](N)Cc1ccc(O)cc1)C(=O)N[C@@H](Cc1ccccc1)C(=O)NCC(=O)N[C@@H](Cc1ccc(O)cc1)C(=O)N1CCC[C@H]1C(=O)N[C@@H](CO)C(N)=O
: