Target
Androgen receptor
Ligand
BDBM18524
Substrate
Meas. Tech.
ChEMBL_2214670 (CHEMBL5127802)
EC50
0.200000±n/a nM
Citation
 Xie, YTian, YZhang, YZhang, ZChen, RLi, MTang, JBian, JLi, ZXu, X Overview of the development of selective androgen receptor modulators (SARMs) as pharmacological treatment for osteoporosis (1998-2021). Eur J Med Chem 230:0 (2022) Target
Name:
Androgen receptor
Synonyms:
ANDR_HUMAN Androgen Receptor Androgen receptor/Baculoviral IAP repeat-containing protein 2 Dihydrotestosterone receptor Nuclear receptor subfamily 3 group C member 4
Type:
Receptor
Mol. Mass.:
99185.27
Organism:
Homo sapiens (Human)
Description:
CHO cells were stably transfected with human AR gene.
Residue:
920
  
Inhibitor
Name:
BDBM18524
Synonyms:
6-[bis(2,2,2-trifluoroethyl)amino]-4-(trifluoromethyl)-1,2-dihydroquinolin-2-one LGD2226
Type:
Small organic molecule
Emp. Form.:
C14H9F9N2O
Mol. Mass.:
392.2197
SMILES:
FC(F)(F)CN(CC(F)(F)F)c1ccc2[nH]c(=O)cc(c2c1)C(F)(F)F
: