Target
Androgen receptor
Ligand
BDBM50238125
Substrate
Meas. Tech.
ChEMBL_2214670 (CHEMBL5127802)
EC50
0.190000±n/a nM
Citation
 Xie, YTian, YZhang, YZhang, ZChen, RLi, MTang, JBian, JLi, ZXu, X Overview of the development of selective androgen receptor modulators (SARMs) as pharmacological treatment for osteoporosis (1998-2021). Eur J Med Chem 230:0 (2022) Target
Name:
Androgen receptor
Synonyms:
ANDR_HUMAN Androgen Receptor Androgen receptor/Baculoviral IAP repeat-containing protein 2 Dihydrotestosterone receptor Nuclear receptor subfamily 3 group C member 4
Type:
Receptor
Mol. Mass.:
99185.27
Organism:
Homo sapiens (Human)
Description:
CHO cells were stably transfected with human AR gene.
Residue:
920
  
Inhibitor
Name:
BDBM50238125
Synonyms:
CHEMBL4090028
Type:
Small organic molecule
Emp. Form.:
C13H15ClN2O
Mol. Mass.:
250.724
SMILES:
C[C@H]1[C@@H](O)CCN1c1ccc(C#N)c(Cl)c1C
: