Target
Amine oxidase [flavin-containing] A
Ligand
BDBM50168969
Substrate
Meas. Tech.
ChEMBL_302385 (CHEMBL830352)
Ki
95±n/a nM
Citation
 Di Santo, RCosti, RRoux, AArtico, MBefani, OMeninno, TAgostinelli, EPalmegiani, PTurini, PCirilli, RFerretti, RGallinella, BLa Torre, F Design, synthesis, and biological activities of pyrrolylethanoneamine derivatives, a novel class of monoamine oxidases inhibitors. J Med Chem 48:4220-3 (2005)  
Target
Name:
Amine oxidase [flavin-containing] A
Synonyms:
AOFA_RAT Amine oxidase [flavin-containing] A Monoamine Oxidase Type A (MAO-A) Monoamine oxidase A (MAO-A) Monoamine oxidase type A (MAOA)
Type:
Enzyme
Mol. Mass.:
59515.21
Organism:
Rattus norvegicus (rat)
Description:
Residue:
526
  
Inhibitor
Name:
BDBM50168969
Synonyms:
2-Amino-1-(1-methyl-1H-pyrrol-2-yl)-2-phenyl-ethanone | CHEMBL361891
Type:
Small organic molecule
Emp. Form.:
C13H14N2O
Mol. Mass.:
214.2631
SMILES:
Cn1cccc1C(=O)C(N)c1ccccc1
: