Target
Amine oxidase [flavin-containing] A
Ligand
BDBM50168973
Substrate
Meas. Tech.
ChEMBL_302385 (CHEMBL830352)
Ki
347±n/a nM
Citation
 Di Santo, RCosti, RRoux, AArtico, MBefani, OMeninno, TAgostinelli, EPalmegiani, PTurini, PCirilli, RFerretti, RGallinella, BLa Torre, F Design, synthesis, and biological activities of pyrrolylethanoneamine derivatives, a novel class of monoamine oxidases inhibitors. J Med Chem 48:4220-3 (2005)  
Target
Name:
Amine oxidase [flavin-containing] A
Synonyms:
AOFA_RAT Amine oxidase [flavin-containing] A Monoamine Oxidase Type A (MAO-A) Monoamine oxidase A (MAO-A) Monoamine oxidase type A (MAOA)
Type:
Enzyme
Mol. Mass.:
59515.21
Organism:
Rattus norvegicus (rat)
Description:
Residue:
526
  
Inhibitor
Name:
BDBM50168973
Synonyms:
2-(4-Methyl-piperazin-1-yl)-1-(1-methyl-1H-pyrrol-2-yl)-2-phenyl-ethanone | CHEMBL364437
Type:
Small organic molecule
Emp. Form.:
C18H23N3O
Mol. Mass.:
297.3947
SMILES:
CN1CCN(CC1)C(C(=O)c1cccn1C)c1ccccc1
: