Target
Presenilin-1
Ligand
BDBM28922
Substrate
Meas. Tech.
ChEMBL_2215014 (CHEMBL5128146)
EC50
15±n/a nM
Citation
 Wen, JLiu, DZhao, L Small molecules targeting ?-secretase and their potential biological applications. Eur J Med Chem 232:0 (2022) Target
Name:
Presenilin-1
Synonyms:
3.4.23.- Gamma-Secretase Subunit Presenilin-1 PS1 PSEN1 PSNL1 Presenilin-1 CTF12 Protein S182
Type:
Mol. Mass.:
52657.13
Organism:
Homo sapiens (Human)
Description:
P49768
Residue:
467
  
Inhibitor
Name:
BDBM28922
Synonyms:
(2S)-N-(5-chlorothiophen-2-yl)-4,4,4-trifluoro-1-hydroxy-3-(trifluoromethyl)butane-2-sulfonamido GSI-953
Type:
Small organic molecule
Emp. Form.:
C9H8ClF6NO3S2
Mol. Mass.:
391.738
SMILES:
OC[C@@H](NS(=O)(=O)c1ccc(Cl)s1)C(C(F)(F)F)C(F)(F)F
: