Target
Cytoplasmic tyrosine-protein kinase BMX
Ligand
BDBM50594997
Substrate
Meas. Tech.
ChEMBL_2215061 (CHEMBL5128193)
IC50
1.1±n/a nM
Citation
 Ran, FLiu, YXu, ZMeng, CYang, DQian, JDeng, XZhang, YLing, Y Recent development of BTK-based dual inhibitors in the treatment of cancers. Eur J Med Chem 233:0 (2022) Target
Name:
Cytoplasmic tyrosine-protein kinase BMX
Synonyms:
BMX BMX_HUMAN Cytoplasmic tyrosine-protein kinase BMX (BMX) Epithelial and endothelial tyrosine kinase Tyrosine Kinase BMX | Tyrosine-protein kinase BMX/ETK
Type:
Tyrosine-protein kinase
Mol. Mass.:
78030.42
Organism:
Homo sapiens (Human)
Description:
P51813
Residue:
675
  
Inhibitor
Name:
BDBM50594997
Synonyms:
CHEMBL5188812
Type:
Small organic molecule
Emp. Form.:
C21H16N4O2S
Mol. Mass.:
388.442
SMILES:
C=CC(=O)Nc1cccc(c1)-c1c[nH]c2ncc(NC(=O)c3cccs3)cc12
: