Target
Mitogen-activated protein kinase 14
Ligand
BDBM13336
Substrate
Meas. Tech.
ChEMBL_306037 (CHEMBL832994)
IC50
72.0±n/a nM
Citation
 Sperandio da Silva, GMLima, LMFraga, CASant'Anna, CMBarreiro, EJ The molecular basis for coxib inhibition of p38alpha MAP kinase. Bioorg Med Chem Lett 15:3506-9 (2005)  
Target
Name:
Mitogen-activated protein kinase 14
Synonyms:
CSAID-binding protein CSBP1 CSPB1 MAP kinase 14 MAP kinase p38 alpha MAPK14 MK14_HUMAN Mitogen-activated protein kinase p38 alpha Stress-activated protein kinase 2a | p38 MAP kinase alpha/beta
Type:
Serine/threonine-protein kinase
Mol. Mass.:
41286.76
Organism:
Homo sapiens (Human)
Description:
Q16539
Residue:
360
  
Inhibitor
Name:
BDBM13336
Synonyms:
4-[4-(4-fluorophenyl)-2-(4-methanesulfinylphenyl)-1H-imidazol-5-yl]pyridine 4-{4-(4-fluorophenyl)-2-[4-(methylsulfinyl)phenyl]-1H-imidazol-5-yl}pyridine SB-203580 cid_176155
Type:
Small organic molecule
Emp. Form.:
C21H16FN3OS
Mol. Mass.:
377.435
SMILES:
CS(=O)c1ccc(cc1)-c1nc(c([nH]1)-c1ccc(F)cc1)-c1ccncc1
: