Target
Histone-lysine N-methyltransferase EHMT1
Ligand
BDBM50595368
Substrate
Meas. Tech.
ChEMBL_2216554 (CHEMBL5129686)
Kd
790±n/a nM
Citation
 Park, KSXiong, YYim, HVelez, JBabault, NKumar, PLiu, JJin, J Discovery of the First-in-Class G9a/GLP Covalent Inhibitors. J Med Chem 65:10506-10522 (2022) Target
Name:
Histone-lysine N-methyltransferase EHMT1
Synonyms:
EHMT1 EUHMTASE1 Euchromatic histone-lysine N-methyltransferase 1 GLP H3-K9-HMTase 5 Histone-lysine N-methyltransferase EHMT1/EHMT2 KMT1D | Lysine N-methyltransferase 1D
Type:
PROTEIN
Mol. Mass.:
141443.67
Organism:
Homo sapiens (Human)
Description:
ChEMBL_1450367
Residue:
1298
  
Inhibitor
Name:
BDBM50595368
Synonyms:
CHEMBL5191615
Type:
Small organic molecule
Emp. Form.:
C27H40N6O3
Mol. Mass.:
496.6449
SMILES:
COc1cc2c(NC3CCN(CC3)C(C)C)nc(NC(=O)C=C)nc2cc1OCCCN1CCCC1
: