Target
Prostaglandin G/H synthase 1
Ligand
BDBM50056999
Substrate
Meas. Tech.
ChEMBL_305495 (CHEMBL831098)
IC50
17400±n/a nM
Citation
 Ottanà, RCarotti, SMaccari, RLandini, IChiricosta, GCaciagli, BVigorita, MGMini, E In vitro antiproliferative activity against human colon cancer cell lines of representative 4-thiazolidinones. Part I. Bioorg Med Chem Lett 15:3930-3 (2005)  
Target
Name:
Prostaglandin G/H synthase 1
Synonyms:
COX-1 Cyclooxygenase Cyclooxygenase-1 (COX-1) PTGS1 | Prostaglandin G/H synthase (cyclooxygenase)
Type:
Enzyme
Mol. Mass.:
68692.62
Organism:
Homo sapiens (Human)
Description:
P23219
Residue:
599
  
Inhibitor
Name:
BDBM50056999
Synonyms:
CHEMBL56367 | nimesulide
Type:
Small organic molecule
Emp. Form.:
C13H12N2O5S
Mol. Mass.:
308.31
SMILES:
CS(=O)(=O)Nc1ccc(cc1Oc1ccccc1)[N+]([O-])=O
: