Target
Adenosine receptor A2a
Ligand
BDBM50595372
Substrate
Meas. Tech.
ChEMBL_2216591 (CHEMBL5129723)
Kd
100000±n/a nM
Citation
 Shepherd, CRobinson, SBerizzi, AThompson, LEJBird, LCulurgioni, SVarzandeh, SRawlins, PBOlsen, RHJNavratilova, IH Surface Plasmon Resonance Screening to Identify Active and Selective Adenosine Receptor Binding Fragments. ACS Med Chem Lett 13:1172-1181 (2022) Target
Name:
Adenosine receptor A2a
Synonyms:
A2A adenosine receptor (hA2A) ADENOSINE A2 ADORA2 Adenosine A2A receptor (A2AAR)
Type:
G Protein-Coupled Receptor (GPCR)
Mol. Mass.:
44716.46
Organism:
Homo sapiens (Human)
Description:
P29274
Residue:
412
  
Inhibitor
Name:
BDBM50595372
Synonyms:
CHEMBL5195119
Type:
Small organic molecule
Emp. Form.:
C14H11N3O2
Mol. Mass.:
253.256
SMILES:
O=C(NCc1ccccc1)c1ccc2nonc2c1
: