Target
Myeloperoxidase
Ligand
BDBM312261
Substrate
Meas. Tech.
ChEMBL_2217367 (CHEMBL5130499)
IC50
31±n/a nM
Citation
 Inghardt, TAntonsson, TEricsson, CHovdal, DJohannesson, PJohansson, CJurva, UKajanus, JKull, BMichaëlsson, EPettersen, ASjögren, TSörensen, HWesterlund, KLindstedt, EL Discovery of AZD4831, a Mechanism-Based Irreversible Inhibitor of Myeloperoxidase, As a Potential Treatment for Heart Failure with Preserved Ejection Fraction. J Med Chem 65:11485-11496 (2022) Target
Name:
Myeloperoxidase
Synonyms:
84 kDa myeloperoxidase MPO Myeloperoxidase Myeloperoxidase heavy chain PERM_HUMAN
Type:
Enzyme
Mol. Mass.:
83888.32
Organism:
Homo sapiens (Human)
Description:
P05164
Residue:
745
  
Inhibitor
Name:
BDBM312261
Synonyms:
1-{2-[(Propan-2-ylamino)methyl]benzyl}-2-thioxo-1,2,3,5-tetrahydro-4H-pyrrolo[3,2-d]pyrimidin-4-one US11000525, Example 13 | US9616063, 13
Type:
Small organic molecule
Emp. Form.:
C17H20N4OS
Mol. Mass.:
328.432
SMILES:
CC(C)NCc1ccccc1Cn1c2cc[nH]c2c(=O)[nH]c1=S
: