Target
Myeloperoxidase
Ligand
BDBM50133595
Substrate
Meas. Tech.
ChEMBL_2217369 (CHEMBL5130501)
IC50
35500±n/a nM
Citation
 Inghardt, TAntonsson, TEricsson, CHovdal, DJohannesson, PJohansson, CJurva, UKajanus, JKull, BMichaëlsson, EPettersen, ASjögren, TSörensen, HWesterlund, KLindstedt, EL Discovery of AZD4831, a Mechanism-Based Irreversible Inhibitor of Myeloperoxidase, As a Potential Treatment for Heart Failure with Preserved Ejection Fraction. J Med Chem 65:11485-11496 (2022) Target
Name:
Myeloperoxidase
Synonyms:
84 kDa myeloperoxidase MPO Myeloperoxidase Myeloperoxidase heavy chain PERM_HUMAN
Type:
Enzyme
Mol. Mass.:
83888.32
Organism:
Homo sapiens (Human)
Description:
P05164
Residue:
745
  
Inhibitor
Name:
BDBM50133595
Synonyms:
CHEMBL3633460
Type:
Small organic molecule
Emp. Form.:
C13H12ClN3O3S
Mol. Mass.:
325.771
SMILES:
COc1ccc(Cl)cc1-c1cc(=O)[nH]c(=S)n1CC(N)=O
: