Target
Cannabinoid receptor 1
Ligand
BDBM21281
Substrate
Meas. Tech.
ChEMBL_302852 (CHEMBL828768)
Ki
1.9±n/a nM
Citation
 Huffman, JWSzklennik, PVAlmond, ABushell, KSelley, DEHe, HCassidy, MPWiley, JLMartin, BR 1-Pentyl-3-phenylacetylindoles, a new class of cannabimimetic indoles. Bioorg Med Chem Lett 15:4110-3 (2005)  
Target
Name:
Cannabinoid receptor 1
Synonyms:
Brain-type cannabinoid receptor CB-R CNR1_RAT Cannabinoid receptor Cnr1 | Skr6
Type:
G Protein-Coupled Receptor (GPCR)
Mol. Mass.:
52856.55
Organism:
Rattus norvegicus (rat)
Description:
P20272
Residue:
473
  
Inhibitor
Name:
BDBM21281
Synonyms:
(11R)-2-methyl-11-(morpholin-4-ylmethyl)-3-(naphthalen-1-ylcarbonyl)-9-oxa-1-azatricyclo[6.3.1.0^{4,12}]dodeca-2,4(12),5,7-tetraene CHEMBL188 WIN 55212-2 WIN55212-2
Type:
Analgesic
Emp. Form.:
C27H26N2O3
Mol. Mass.:
426.5069
SMILES:
Cc1c(C(=O)c2cccc3ccccc23)c2cccc3OC[C@@H](CN4CCOCC4)n1c23
: