Target
Potassium voltage-gated channel subfamily H member 2
Ligand
BDBM50596276
Substrate
Meas. Tech.
ChEMBL_2220026 (CHEMBL5133360)
EC50
7000±n/a nM
Citation
 Flagstad, TPedersen, MTJakobsen, THFelding, JTolker-Nielsen, TGivskov, MQvortrup, KNielsen, TE Solid-phase synthesis and biological evaluation of piperazine-based novel bacterial topoisomerase inhibitors. Bioorg Med Chem Lett 57:0 (2022) Target
Name:
Potassium voltage-gated channel subfamily H member 2
Synonyms:
1,3-beta-glucan synthase component GLS2 ERG Eag-related protein 1 Ether-a-go-go-related gene (HERG) Ether-a-go-go-related gene potassium channel 1 Ether-a-go-go-related gene potassium channel 1 (hERG1) Ether-a-go-go-related protein 1 H-ERG KCNH2 Potassium voltage-gated channel subfamily H member 2 (hERG) Voltage-gated potassium channel subunit Kv11.1 hERG Potassium Channel 1 | putative potassium channel subunit
Type:
Multi-pass membrane protein
Mol. Mass.:
126672.65
Organism:
Homo sapiens (Human)
Description:
Q12809
Residue:
1159
  
Inhibitor
Name:
BDBM50596276
Synonyms:
CHEMBL5207002
Type:
Small organic molecule
Emp. Form.:
C24H26FN3O4S2
Mol. Mass.:
503.609
SMILES:
COc1ccc2ncc(F)c(CCCN3CCN(C[C@@H]3C(O)=O)C(=O)CSc3cccs3)c2c1
: