Target
Sphingosine 1-phosphate receptor 5
Ligand
BDBM50158336
Substrate
Meas. Tech.
ChEMBL_304345 (CHEMBL839771)
pH
7.4±n/a
EC50
>10000±n/a nM
Comments
extracted
Citation
 Albert, RHinterding, KBrinkmann, VGuerini, DMüller-Hartwieg, CKnecht, HSimeon, CStreiff, MWagner, TWelzenbach, KZécri, FZollinger, MCooke, NFrancotte, E Novel immunomodulator FTY720 is phosphorylated in rats and humans to form a single stereoisomer. Identification, chemical proof, and biological characterization of the biologically active species and its enantiomer. J Med Chem 48:5373-7 (2005)  
Target
Name:
Sphingosine 1-phosphate receptor 5
Synonyms:
EDG8 S1P5 S1PR5_HUMAN Sphingosine 1-phosphate receptor Edg-8
Type:
G Protein-Coupled Receptor (GPCR)
Mol. Mass.:
41796.42
Organism:
Homo sapiens (Human)
Description:
Residue:
398
  
Inhibitor
Name:
BDBM50158336
Synonyms:
2-(4-octylphenethyl)-2-aminopropane-1,3-diol 2-amino-2-(4-octylphenethyl)propane-1,3-diol CHEMBL314854 FINGOLIMOD HYDROCHLORIDE
Type:
Small organic molecule
Emp. Form.:
C19H33NO2
Mol. Mass.:
307.4708
SMILES:
CCCCCCCCc1ccc(CCC(N)(CO)CO)cc1
: