Target
Sphingosine 1-phosphate receptor 5
Ligand
BDBM23163
Substrate
Meas. Tech.
ChEMBL_304345 (CHEMBL839771)
pH
7.4±n/a
EC50
4.9±n/a nM
Comments
extracted
Citation
 Albert, RHinterding, KBrinkmann, VGuerini, DMüller-Hartwieg, CKnecht, HSimeon, CStreiff, MWagner, TWelzenbach, KZécri, FZollinger, MCooke, NFrancotte, E Novel immunomodulator FTY720 is phosphorylated in rats and humans to form a single stereoisomer. Identification, chemical proof, and biological characterization of the biologically active species and its enantiomer. J Med Chem 48:5373-7 (2005)  
Target
Name:
Sphingosine 1-phosphate receptor 5
Synonyms:
EDG8 S1P5 S1PR5_HUMAN Sphingosine 1-phosphate receptor Edg-8
Type:
G Protein-Coupled Receptor (GPCR)
Mol. Mass.:
41796.42
Organism:
Homo sapiens (Human)
Description:
Residue:
398
  
Inhibitor
Name:
BDBM23163
Synonyms:
CHEMBL114606 {2-amino-3-hydroxy-2-[2-(4-octylphenyl)ethyl]propoxy}phosphonic acid
Type:
Small organic molecule
Emp. Form.:
C19H34NO5P
Mol. Mass.:
387.4507
SMILES:
CCCCCCCCc1ccc(CCC(N)(CO)COP(O)(O)=O)cc1
: