Target
Tyrosine-protein kinase Tec
Ligand
BDBM250082
Substrate
Meas. Tech.
ChEMBL_2220483 (CHEMBL5133817)
Kd
18±n/a nM
Citation
 Ma, BMetrick, CMGu, CHoemberger, MBajrami, BBame, EHuang, JMingueneau, MMurugan, PSantoro, JCTang, HWang, THopkins, BT Optimization of a novel piperazinone series as potent selective peripheral covalent BTK inhibitors. Bioorg Med Chem Lett 60:0 (2022) Target
Name:
Tyrosine-protein kinase Tec
Synonyms:
PSCTK4 TEC_HUMAN | Tyrosine-protein kinase TEC (TEC)
Type:
Protein
Mol. Mass.:
73597.00
Organism:
Homo sapiens (Human)
Description:
Residue:
631
  
Inhibitor
Name:
BDBM250082
Synonyms:
US9447106, 27b (peak 2) | US9556188, Compound 27a
Type:
Small organic molecule
Emp. Form.:
C27H29N5O3
Mol. Mass.:
471.5509
SMILES:
NC(=O)c1c2NCC[C@@H](C3CCN(CC3)C(=O)C=C)n2nc1-c1ccc(Oc2ccccc2)cc1
: