Target
Thyroid hormone receptor beta
Ligand
BDBM18869
Substrate
Meas. Tech.
ChEMBL_321321 (CHEMBL882591)
IC50
1.1±n/a nM
Citation
 Hangeland, JJFriends, TJDoweyko, AMMellström, KSandberg, JGrynfarb, MRyono, DE A new class of high affinity thyromimetics containing a phenyl-naphthylene core. Bioorg Med Chem Lett 15:4579-84 (2005)  
Target
Name:
Thyroid hormone receptor beta
Synonyms:
ERBA2 Nuclear receptor subfamily 1 group A member 2 THR1 c-erbA-2 | c-erbA-beta
Type:
Receptor
Mol. Mass.:
52793.62
Organism:
Homo sapiens (Human)
Description:
Recombinant hThR was obtained from nuclear extracts from SF9 cells infected with baculovirus vectors encoding for ThRbeta 1.
Residue:
461
  
Inhibitor
Name:
BDBM18869
Synonyms:
2-{3,5-dichloro-4-[4-hydroxy-3-(propan-2-yl)phenoxy]phenyl}acetic acid KB-141
Type:
Small organic molecule
Emp. Form.:
C17H16Cl2O4
Mol. Mass.:
355.213
SMILES:
CC(C)c1cc(Oc2c(Cl)cc(CC(O)=O)cc2Cl)ccc1O
: