Target
Cannabinoid receptor 2
Ligand
BDBM50172148
Substrate
Meas. Tech.
ChEMBL_320783 (CHEMBL884738)
Ki
30±n/a nM
Citation
 Shankar, BBLavey, BJZhou, GSpitler, JATong, LRizvi, RYang, DYWolin, RKozlowski, JAShih, NYWu, JHipkin, RWGonsiorek, WLunn, CA Triaryl bis-sulfones as cannabinoid-2 receptor ligands: SAR studies. Bioorg Med Chem Lett 15:4417-20 (2005)  
Target
Name:
Cannabinoid receptor 2
Synonyms:
CANNABINOID CB2 CB2 CB2B CNR2_HUMAN Cannabinoid CB2 receptor Cannabinoid receptor 2 (CB2R) | hCB2
Type:
G Protein-Coupled Receptor (GPCR)
Mol. Mass.:
39690.94
Organism:
Homo sapiens (Human)
Description:
P34972
Residue:
360
  
Inhibitor
Name:
BDBM50172148
Synonyms:
CHEMBL198062 | N-((R)-1-{4-[4-Methoxy-2-(4-methoxy-benzenesulfonyl)-benzenesulfonyl]-phenyl}-ethyl)-methanesulfonamide
Type:
Small organic molecule
Emp. Form.:
C23H25NO8S3
Mol. Mass.:
539.642
SMILES:
COc1ccc(cc1)S(=O)(=O)c1cc(OC)ccc1S(=O)(=O)c1ccc(cc1)[C@@H](C)NS(C)(=O)=O
: