Target
Melanin-concentrating hormone receptor 1
Ligand
BDBM50172415
Substrate
Meas. Tech.
ChEMBL_321621 (CHEMBL871630)
IC50
43±n/a nM
Citation
 Ulven, TFrimurer, TMReceveur, JMLittle, PBRist, ONørregaard, PKHögberg, T 6-Acylamino-2-aminoquinolines as potent melanin-concentrating hormone 1 receptor antagonists. Identification, structure-activity relationship, and investigation of binding mode. J Med Chem 48:5684-97 (2005)  
Target
Name:
Melanin-concentrating hormone receptor 1
Synonyms:
G-protein coupled receptor 24 MCH receptor 1 MCH-R1 MCHR-1 MCHR1_HUMAN Melanin-Concentrating Hormone Receptor 1 (MCH1R) Melanin-concentrating hormone receptor 1 (MCH-1) Melanin-concentrating hormone receptor 1 (MCHR-1) SLC-1 Somatostatin receptor-like protein
Type:
G Protein-Coupled Receptor (GPCR)
Mol. Mass.:
45976.27
Organism:
Homo sapiens (Human)
Description:
Membranes from CHO-K1 cells stably expressing human MCH1R were used in assays.
Residue:
422
  
Inhibitor
Name:
BDBM50172415
Synonyms:
2-(2,4-Dichloro-phenoxy)-N-{2-[(2-hydroxy-ethyl)-methyl-amino]-4-methyl-quinolin-6-yl}-acetamide | CHEMBL197245
Type:
Small organic molecule
Emp. Form.:
C21H21Cl2N3O3
Mol. Mass.:
434.316
SMILES:
CN(CCO)c1cc(C)c2cc(NC(=O)COc3ccc(Cl)cc3Cl)ccc2n1
: