Target
Lysosomal alpha-glucosidase
Ligand
BDBM50596693
Substrate
Meas. Tech.
ChEMBL_2222063 (CHEMBL5135397)
IC50
630±n/a nM
Citation
 Wang, JZCheng, BKato, AKise, MShimadate, YJia, YMLi, YXFleet, GWJYu, CY Design, synthesis and glycosidase inhibition of C-4 branched LAB and DAB derivatives. Eur J Med Chem 233:0 (2022) Target
Name:
Lysosomal alpha-glucosidase
Synonyms:
70 kDa lysosomal alpha-glucosidase Acid maltase Alpha glucosidase LYAG_HUMAN
Type:
PROTEIN
Mol. Mass.:
105312.45
Organism:
Homo sapiens (Human)
Description:
ChEMBL_1506060
Residue:
952
  
Inhibitor
Name:
BDBM50596693
Synonyms:
CHEMBL5189075
Type:
Small organic molecule
Emp. Form.:
C11H15NO3
Mol. Mass.:
209.2417
SMILES:
OC[C@@]1(NC[C@H](O)[C@H]1O)c1ccccc1
: