Target
5-hydroxytryptamine receptor 2B
Ligand
BDBM10755
Substrate
Meas. Tech.
ChEMBL_2222509 (CHEMBL5135843)
EC50
0.363078±n/a nM
Citation
 Orr, MJCao, ABWang, CTGaisin, ACsakai, AFriswold, APMeltzer, HYMcCorvy, JDScheidt, KA Discovery of Highly Potent Serotonin 5-HT ACS Med Chem Lett 13:648-657 (2022) Target
Name:
5-hydroxytryptamine receptor 2B
Synonyms:
5-HT-2B 5-hydroxytryptamine (serotonin) receptor 2B [Homo sapiens] 5-hydroxytryptamine receptor 2C (5HT2C) HTR2B Serotonin 2b (5-HT2b) receptor | Serotonin Receptor 2B
Type:
G Protein-Coupled Receptor (GPCR)
Mol. Mass.:
54312.47
Organism:
Homo sapiens (Human)
Description:
Receptor binding assays were performed using human clone stably expressed in CHO cells.
Residue:
481
  
Inhibitor
Name:
BDBM10755
Synonyms:
14C-5-hydroxy tryptamine creatinine disulfate 5-HT 5-hydroxy tryptamine creatinine disulfate Serotonin | [3H]-5-HT
Type:
Small organic molecule
Emp. Form.:
C10H12N2O
Mol. Mass.:
176.2151
SMILES:
NCCc1c[nH]c2ccc(O)cc12
: