Target
5-hydroxytryptamine receptor 2B
Ligand
BDBM50596936
Substrate
Meas. Tech.
ChEMBL_2222509 (CHEMBL5135843)
EC50
3.1±n/a nM
Citation
 Orr, MJCao, ABWang, CTGaisin, ACsakai, AFriswold, APMeltzer, HYMcCorvy, JDScheidt, KA Discovery of Highly Potent Serotonin 5-HT ACS Med Chem Lett 13:648-657 (2022) Target
Name:
5-hydroxytryptamine receptor 2B
Synonyms:
5-HT-2B 5-hydroxytryptamine (serotonin) receptor 2B [Homo sapiens] 5-hydroxytryptamine receptor 2C (5HT2C) HTR2B Serotonin 2b (5-HT2b) receptor | Serotonin Receptor 2B
Type:
G Protein-Coupled Receptor (GPCR)
Mol. Mass.:
54312.47
Organism:
Homo sapiens (Human)
Description:
Receptor binding assays were performed using human clone stably expressed in CHO cells.
Residue:
481
  
Inhibitor
Name:
BDBM50596936
Synonyms:
CHEMBL5170784
Type:
Small organic molecule
Emp. Form.:
C18H17ClN2O2
Mol. Mass.:
328.793
SMILES:
COc1ccc(C2NCCc3c2[nH]c2ccc(Cl)cc32)c(O)c1
: