Target
D(1A) dopamine receptor
Ligand
BDBM50173090
Substrate
Meas. Tech.
ChEMBL_320765 (CHEMBL884720)
Ki
>10000±n/a nM
Citation
 Huang, YBae, SARoth, BLLaruelle, M Synthesis of potent and selective serotonin 5-HT1B receptor ligands. Bioorg Med Chem Lett 15:4786-9 (2005)  
Target
Name:
D(1A) dopamine receptor
Synonyms:
DA D1 receptor DRD1 Dopamine D1 receptor Dopamine D1A
Type:
Enzyme
Mol. Mass.:
49303.43
Organism:
Homo sapiens (Human)
Description:
P21728
Residue:
446
  
Inhibitor
Name:
BDBM50173090
Synonyms:
4-(4-Fluoro-phenyl)-piperazine-1-carboxylic acid [4-methoxy-3-(4-methyl-piperazin-1-yl)-phenyl]-amide | CHEMBL194206
Type:
Small organic molecule
Emp. Form.:
C23H30FN5O2
Mol. Mass.:
427.515
SMILES:
COc1ccc(NC(=O)N2CCN(CC2)c2ccc(F)cc2)cc1N1CCN(C)CC1
: