Target
Ubiquitin carboxyl-terminal hydrolase 8
Ligand
BDBM50597451
Substrate
Meas. Tech.
ChEMBL_2223456 (CHEMBL5136790)
IC50
560±n/a nM
Citation
 Tian, YLiu, KLiu, RQiu, ZXu, YWei, WXu, XWang, JDing, HLi, ZBian, J Discovery of Potent Small-Molecule USP8 Inhibitors for the Treatment of Breast Cancer through Regulating ER? Expression. J Med Chem 65:8914-8932 (2022) Target
Name:
Ubiquitin carboxyl-terminal hydrolase 8
Synonyms:
Deubiquitinating enzyme 8 UBP8_HUMAN USP8 Ubiquitin thioesterase 8 hUBPy
Type:
PROTEIN
Mol. Mass.:
127547.92
Organism:
Homo sapiens (Human)
Description:
ChEMBL_105200
Residue:
1118
  
Inhibitor
Name:
BDBM50597451
Synonyms:
CHEMBL5202404
Type:
Small organic molecule
Emp. Form.:
C16H9N5O
Mol. Mass.:
287.2756
SMILES:
C=CCO\N=C1/c2ccccc2-c2nc(C#N)c(nc12)C#N
: