Target
MAP kinase-interacting serine/threonine-protein kinase 2
Ligand
BDBM50597690
Substrate
Meas. Tech.
ChEMBL_2224141 (CHEMBL5137654)
Ki
430±n/a nM
Citation
 Xu, WKannan, SVerma, CSNacro, K Update on the Development of MNK Inhibitors as Therapeutic Agents. J Med Chem 65:983-1007 (2022) Target
Name:
MAP kinase-interacting serine/threonine-protein kinase 2
Synonyms:
GPRK7 MAP kinase-interacting serine/threonine-protein kinase 2 (MKNK2) MAP-kinase interacting kinase 2 (MNK2) MKNK2_HUMAN | MNK2
Type:
Protein
Mol. Mass.:
51870.79
Organism:
Homo sapiens (Human)
Description:
Q9HBH9
Residue:
465
  
Inhibitor
Name:
BDBM50597690
Synonyms:
CHEMBL5174348
Type:
Small organic molecule
Emp. Form.:
C11H8FN5
Mol. Mass.:
229.2131
SMILES:
Fc1ccc(Nc2ncnc3[nH]ccc23)nc1
: