Target
MAP kinase-interacting serine/threonine-protein kinase 2
Ligand
BDBM168281
Substrate
Meas. Tech.
ChEMBL_2224141 (CHEMBL5137654)
Ki
30±n/a nM
Citation
 Xu, WKannan, SVerma, CSNacro, K Update on the Development of MNK Inhibitors as Therapeutic Agents. J Med Chem 65:983-1007 (2022) Target
Name:
MAP kinase-interacting serine/threonine-protein kinase 2
Synonyms:
GPRK7 MAP kinase-interacting serine/threonine-protein kinase 2 (MKNK2) MAP-kinase interacting kinase 2 (MNK2) MKNK2_HUMAN | MNK2
Type:
Protein
Mol. Mass.:
51870.79
Organism:
Homo sapiens (Human)
Description:
Q9HBH9
Residue:
465
  
Inhibitor
Name:
BDBM168281
Synonyms:
US9669031, 109 8-chloro-6-(pyrimidin-4-ylamino)spiro[2H-imidazo[1,5-a]pyridine-3,1′-cyclohexane]-1,5-dione hydrochloride (Cpd. No. 109)
Type:
Small organic molecule
Emp. Form.:
C16H16ClN5O2
Mol. Mass.:
345.784
SMILES:
Clc1cc(Nc2ccncn2)c(=O)n2c1C(=O)NC21CCCCC1
: