Target
MAP kinase-interacting serine/threonine-protein kinase 2
Ligand
BDBM50512741
Substrate
Meas. Tech.
ChEMBL_2224141 (CHEMBL5137654)
Ki
43±n/a nM
Citation
 Xu, WKannan, SVerma, CSNacro, K Update on the Development of MNK Inhibitors as Therapeutic Agents. J Med Chem 65:983-1007 (2022) Target
Name:
MAP kinase-interacting serine/threonine-protein kinase 2
Synonyms:
GPRK7 MAP kinase-interacting serine/threonine-protein kinase 2 (MKNK2) MAP-kinase interacting kinase 2 (MNK2) MKNK2_HUMAN | MNK2
Type:
Protein
Mol. Mass.:
51870.79
Organism:
Homo sapiens (Human)
Description:
Q9HBH9
Residue:
465
  
Inhibitor
Name:
BDBM50512741
Synonyms:
CHEMBL4466664
Type:
Small organic molecule
Emp. Form.:
C15H15ClN4O3
Mol. Mass.:
334.758
SMILES:
Clc1cc(Nc2ccon2)c(=O)n2c1C(=O)NC21CCCCC1
: