Target
Eukaryotic translation initiation factor 4E
Ligand
BDBM50597672
Substrate
Meas. Tech.
ChEMBL_2224162 (CHEMBL5137675)
IC50
32±n/a nM
Citation
 Xu, WKannan, SVerma, CSNacro, K Update on the Development of MNK Inhibitors as Therapeutic Agents. J Med Chem 65:983-1007 (2022) Target
Name:
Eukaryotic translation initiation factor 4E
Synonyms:
EIF4E EIF4F Eukaryotic translation initiation factor 4E (eIF4E) IF4E_HUMAN
Type:
Protein
Mol. Mass.:
25095.44
Organism:
Homo sapiens (Human)
Description:
P06730
Residue:
217
  
Inhibitor
Name:
BDBM50597672
Synonyms:
CHEMBL5195560
Type:
Small organic molecule
Emp. Form.:
C17H17N5O
Mol. Mass.:
307.3498
SMILES:
CC(C)Oc1cc(ccc1Nc1ncnc2ccn(C)c12)C#N
: