Target
Eukaryotic translation initiation factor 4E
Ligand
BDBM50597679
Substrate
Meas. Tech.
ChEMBL_2224166 (CHEMBL5137679)
IC50
25±n/a nM
Citation
 Xu, WKannan, SVerma, CSNacro, K Update on the Development of MNK Inhibitors as Therapeutic Agents. J Med Chem 65:983-1007 (2022) Target
Name:
Eukaryotic translation initiation factor 4E
Synonyms:
EIF4E EIF4F Eukaryotic translation initiation factor 4E (eIF4E) IF4E_HUMAN
Type:
Protein
Mol. Mass.:
25095.44
Organism:
Homo sapiens (Human)
Description:
P06730
Residue:
217
  
Inhibitor
Name:
BDBM50597679
Synonyms:
CHEMBL5195407
Type:
Small organic molecule
Emp. Form.:
C16H16FN5O2S
Mol. Mass.:
361.394
SMILES:
CNC(=O)c1nc2c(Nc3ccc(F)cc3OC(C)C)ncnc2s1
: