Target
Eukaryotic translation initiation factor 4E
Ligand
BDBM50597687
Substrate
Meas. Tech.
ChEMBL_2224166 (CHEMBL5137679)
IC50
32±n/a nM
Citation
 Xu, WKannan, SVerma, CSNacro, K Update on the Development of MNK Inhibitors as Therapeutic Agents. J Med Chem 65:983-1007 (2022) Target
Name:
Eukaryotic translation initiation factor 4E
Synonyms:
EIF4E EIF4F Eukaryotic translation initiation factor 4E (eIF4E) IF4E_HUMAN
Type:
Protein
Mol. Mass.:
25095.44
Organism:
Homo sapiens (Human)
Description:
P06730
Residue:
217
  
Inhibitor
Name:
BDBM50597687
Synonyms:
CHEMBL5180948
Type:
Small organic molecule
Emp. Form.:
C20H21ClN6OS
Mol. Mass.:
428.938
SMILES:
Clc1ccc2N(CCc2c1)c1ncnc2sc(nc12)C(=O)NCC1CCNCC1
: