Target
Triosephosphate isomerase, glycosomal
Ligand
BDBM50597989
Substrate
Meas. Tech.
ChEMBL_2224918 (CHEMBL5138431)
IC50
33000±n/a nM
Citation
 Beltran-Hortelano, IAlcolea, VFont, MPérez-Silanes, S Examination of multiple Trypanosoma cruzi targets in a new drug discovery approach for Chagas disease. Bioorg Med Chem 58:0 (2022) Target
Name:
Triosephosphate isomerase, glycosomal
Synonyms:
TIM Triose-phosphate isomerase
Type:
PROTEIN
Mol. Mass.:
27334.70
Organism:
Trypanosoma cruzi
Description:
ChEMBL_596695
Residue:
251
  
Inhibitor
Name:
BDBM50597989
Synonyms:
CHEMBL1161789
Type:
Small organic molecule
Emp. Form.:
C10H11NO3S3
Mol. Mass.:
289.394
SMILES:
OS(=O)(=O)CCCSc1nc2ccccc2s1
: