Target
Proto-oncogene tyrosine-protein kinase Src
Ligand
BDBM50174939
Substrate
Meas. Tech.
ChEMBL_326930 (CHEMBL863345)
IC50
5±n/a nM
Citation
 Barlaam, BFennell, MGermain, HGreen, THennequin, LMorgentin, ROlivier, APlé, PVautier, MCostello, G New heterocyclic analogues of 4-(2-chloro-5-methoxyanilino)quinazolines as potent and selective c-Src kinase inhibitors. Bioorg Med Chem Lett 15:5446-9 (2005)  
Target
Name:
Proto-oncogene tyrosine-protein kinase Src
Synonyms:
Calmodulin/Proto-oncogene tyrosine-protein kinase Src Proto-oncogene c-Src SRC SRC_HUMAN V-src sarcoma (Schmidt-Ruppin A-2) viral oncogene homolog (avian) p60-Src | pp60c-src
Type:
Protein
Mol. Mass.:
59838.60
Organism:
Homo sapiens (Human)
Description:
P12931
Residue:
536
  
Inhibitor
Name:
BDBM50174939
Synonyms:
CHEMBL424664 | N-(3-chloro-6-methoxypyridin-2-yl)-7-(3-morpholinopropoxy)-5-(tetrahydro-2H-pyran-4-yloxy)quinazolin-4-amine
Type:
Small organic molecule
Emp. Form.:
C26H32ClN5O5
Mol. Mass.:
530.016
SMILES:
COc1ccc(Cl)c(Nc2ncnc3cc(OCCCN4CCOCC4)cc(OC4CCOCC4)c23)n1
: