Target
Carbonic anhydrase 2
Ligand
BDBM50175049
Substrate
Meas. Tech.
ChEMBL_326924 (CHEMBL854316)
Ki
8.6±n/a nM
Citation
 Poulsen, SABornaghi, LFHealy, PC Synthesis and structure-activity relationships of novel benzene sulfonamides with potent binding affinity for bovine carbonic anhydrase II. Bioorg Med Chem Lett 15:5429-33 (2005)  
Target
Name:
Carbonic anhydrase 2
Synonyms:
CA2 Carbonic anhydrase Carbonic anhydrase II Carbonic anhydrase II (CA-II)
Type:
Enzyme Catalytic Domain
Mol. Mass.:
29115.93
Organism:
Bos taurus
Description:
Residue:
260
  
Inhibitor
Name:
BDBM50175049
Synonyms:
CHEMBL381455 | allyl 4-(aminosulfonyl)benzoate
Type:
Small organic molecule
Emp. Form.:
C10H11NO4S
Mol. Mass.:
241.264
SMILES:
NS(=O)(=O)c1ccc(cc1)C(=O)OCC=C
: