Target
Kallikrein-7
Ligand
BDBM50598289
Substrate
Meas. Tech.
ChEMBL_2226674 (CHEMBL5140187)
Ki
94±n/a nM
Citation
 Gonschorek, PZorzi, AMaric, TLe Jeune, MSchüttel, MMontagnon, MGómez-Ojea, RVollmar, DPWhitfield, CReymond, LCarle, VVerma, HSchilling, OHovnanian, AHeinis, C Phage Display Selected Cyclic Peptide Inhibitors of Kallikrein-Related Peptidases 5 and 7 and Their  J Med Chem 65:9735-9749 (2022) Target
Name:
Kallikrein-7
Synonyms:
KLK7 Kallikrein 7 PRSS6 Serine protease 6 hK7 kallikrein-7 isoform 1 preproprotein
Type:
PROTEIN
Mol. Mass.:
27535.05
Organism:
Homo sapiens (Human)
Description:
ChEMBL_1469257
Residue:
253
  
Inhibitor
Name:
BDBM50598289
Synonyms:
CHEMBL5190884
Type:
Small organic molecule
Emp. Form.:
C93H139N29O28S5
Mol. Mass.:
2271.601
SMILES:
CSCC[C@H](NC(=O)[C@@H]1CSCc2cccc(CSC[C@H](NC(=O)[C@@H](N)CCCNC(N)=N)C(=O)N[C@@H](CC(O)=O)C(=O)N[C@@H](CO)C(=O)N[C@@H](CO)C(=O)N[C@@H](CCC(N)=O)C(=O)N1)n2)C(=O)N[C@@H](CCC(N)=O)C(=O)NCC(=O)N[C@@H](CCC(N)=O)C(=O)N[C@H]1CSCc2cccc(CSC[C@H](NC(=O)[C@H](CO)NC(=O)[C@H](CCCNC(N)=N)NC(=O)[C@H](Cc3ccc(O)cc3)NC(=O)[C@H](CC(C)C)NC1=O)C(=O)N1CCC[C@H]1C(O)=O)n2
: