Target
Kallikrein-7
Ligand
BDBM50598291
Substrate
Meas. Tech.
ChEMBL_2226674 (CHEMBL5140187)
Ki
32±n/a nM
Citation
 Gonschorek, PZorzi, AMaric, TLe Jeune, MSchüttel, MMontagnon, MGómez-Ojea, RVollmar, DPWhitfield, CReymond, LCarle, VVerma, HSchilling, OHovnanian, AHeinis, C Phage Display Selected Cyclic Peptide Inhibitors of Kallikrein-Related Peptidases 5 and 7 and Their  J Med Chem 65:9735-9749 (2022) Target
Name:
Kallikrein-7
Synonyms:
KLK7 Kallikrein 7 PRSS6 Serine protease 6 hK7 kallikrein-7 isoform 1 preproprotein
Type:
PROTEIN
Mol. Mass.:
27535.05
Organism:
Homo sapiens (Human)
Description:
ChEMBL_1469257
Residue:
253
  
Inhibitor
Name:
BDBM50598291
Synonyms:
CHEMBL5177855
Type:
Small organic molecule
Emp. Form.:
C90H133N25O25S4
Mol. Mass.:
2093.432
SMILES:
CC[C@H](C)[C@@H]1NC(=O)[C@H](Cc2ccc(O)cc2)NC(=O)[C@H](CC(C)C)NC(=O)[C@H](CSCc2cccc(CSC[C@H](NC(=O)[C@H](C)NC1=O)C(=O)N1CCC[C@H]1C(=O)N[C@@H](CO)C(=O)N[C@@H](C)C(=O)N[C@@H](C)C(=O)N[C@@H](CCCCN)C(=O)N[C@H]1CSCc3cccc(CSC[C@H](NC(=O)CNC(=O)[C@H](CC(N)=O)NC(=O)[C@H](CC(O)=O)NC1=O)C(=O)N[C@@H](CCC(N)=O)C(N)=O)n3)n2)NC(=O)[C@@H](N)CCC(N)=O
: