Target
Kallikrein-7
Ligand
BDBM50598294
Substrate
Meas. Tech.
ChEMBL_2226674 (CHEMBL5140187)
Ki
>1000±n/a nM
Citation
 Gonschorek, PZorzi, AMaric, TLe Jeune, MSchüttel, MMontagnon, MGómez-Ojea, RVollmar, DPWhitfield, CReymond, LCarle, VVerma, HSchilling, OHovnanian, AHeinis, C Phage Display Selected Cyclic Peptide Inhibitors of Kallikrein-Related Peptidases 5 and 7 and Their  J Med Chem 65:9735-9749 (2022) Target
Name:
Kallikrein-7
Synonyms:
KLK7 Kallikrein 7 PRSS6 Serine protease 6 hK7 kallikrein-7 isoform 1 preproprotein
Type:
PROTEIN
Mol. Mass.:
27535.05
Organism:
Homo sapiens (Human)
Description:
ChEMBL_1469257
Residue:
253
  
Inhibitor
Name:
BDBM50598294
Synonyms:
CHEMBL5185478
Type:
Small organic molecule
Emp. Form.:
C101H134N22O28S4
Mol. Mass.:
2232.535
SMILES:
[H][C@@]12CCCN1C(=O)[C@H](Cc1c[nH]c3ccccc13)NC(=O)[C@H](CC(C)C)NC(=O)[C@H](CSCC(=O)CSC[C@H](NC(=O)[C@H](Cc1c[nH]c3ccccc13)NC2=O)C(=O)N[C@@H](CCC(N)=O)C(=O)N1CCC[C@H]1C(=O)N1CCC[C@H]1C(=O)N[C@@H](CCC(O)=O)C(=O)N[C@@H](C)C(=O)N[C@H]1CSCC(=O)CSC[C@H](NC(=O)[C@H](CCC(N)=O)NC(=O)[C@H](CO)NC(=O)[C@]2([H])CCCN2C1=O)C(=O)N[C@@H](CCC(O)=O)C(O)=O)NC(=O)[C@@H](N)Cc1ccccc1
: